Reaction Details
TargetBeta-galactosidase
LigandBDBM50133508
Substrate/Competitorn/a
Meas. Tech.ChEMBL_37271 (CHEMBL656021)
IC50 1000±n/a nM
Citation Ogawa, SFujieda, SSakata, YIshizaki, MHisamatsu, SOkazaki, K Synthesis and glycosidase inhibitory activity of some N-substituted 6-deoxy-5a-carba-beta-DL- and L-galactopyranosylamines. Bioorg Med Chem Lett13:3461-3 (2003) Beta-galactosidase
Name:Beta-galactosidase
Type:Protein
Mol. Mass.:73420.88
Organism:Bos taurus (Bovine)
Description:n/a
Residue:653
BDBM50133508
NameBDBM50133508
Synonyms:(1R,3R,4S)-4-Decylamino-6-methyl-cyclohexane-1,2,3-triol | CHEMBL116366
TypeSmall organic molecule
Emp. Form.C17H35NO3
Mol. Mass.301.4647
SMILESCCCCCCCCCCN[C@H]1CC(C)[C@@H](O)C(O)[C@@H]1O