Reaction Details
TargetCannabinoid receptor 1
LigandBDBM50133543
Substrate/Competitorn/a
Meas. Tech.ChEMBL_46457 (CHEMBL657904)
Ki 17±n/a nM
Citation Krishnamurthy, MFerreira, AMMoore, BM Synthesis and testing of novel phenyl substituted side-chain analogues of classical cannabinoids. Bioorg Med Chem Lett13:3487-90 (2003) Cannabinoid receptor 1
Name:Cannabinoid receptor 1
Type:G Protein-Coupled Receptor (GPCR)
Mol. Mass.:52868.96
Organism:Homo sapiens (Human)
Description:P21554
Residue:472
BDBM50133543
NameBDBM50133543
Synonyms:(6aR,10aR)-6,6,9-Trimethyl-3-(2-phenyl-[1,3]dithiolan-2-yl)-6a,7,10,10a-tetrahydro-6H-benzo[c]chromen-1-ol CHEMBL118028
TypeSmall organic molecule
Emp. Form.C25H28O2S2
Mol. Mass.424.619
SMILESCC1=CC[C@@H]2[C@@H](C1)c1c(O)cc(cc1OC2(C)C)C1(SCCS1)c1ccccc1