Reaction Details
TargetInosine-5'-monophosphate dehydrogenase 2
LigandBDBM50120529
Substrate/Competitorn/a
Meas. Tech.ChEBML_89932
IC50 7±n/a nM
Citation Dhar, TGShen, ZGu, HHChen, PNorris, DWatterson, SHBallentine, SKFleener, CARouleau, KABarrish, JCTownsend, RHollenbaugh, DLIwanowicz, EJ 3-cyanoindole-based inhibitors of inosine monophosphate dehydrogenase: synthesis and initial structure-activity relationships. Bioorg Med Chem Lett13:3557-60 (2003) Inosine-5'-monophosphate dehydrogenase 2
Name:Inosine-5'-monophosphate dehydrogenase 2
Type:Enzyme
Mol. Mass.:55806.87
Organism:Homo sapiens (Human)
Description:Recombinant IMPDH2 expressed in E. coli.
Residue:514
BDBM50120529
NameBDBM50120529
Synonyms:Acetic acid (methyl-{2-[2-(3-oxazol-5-yl-1H-indol-6-ylamino)-oxazol-5-yl]-phenyl}-carbamoyl)-methyl ester | CHEMBL109312
TypeSmall organic molecule
Emp. Form.C25H21N5O5
Mol. Mass.471.4647
SMILESCN(C(=O)COC(C)=O)c1ccccc1-c1cnc(Nc2ccc3c(c[nH]c3c2)-c2cnco2)o1