Reaction Details
TargetCapsid scaffolding protein
LigandBDBM50133985
Substrate/Competitorn/a
Meas. Tech.ChEMBL_158964 (CHEMBL769610)
Ki 43±n/a nM
Citation Borthwick, ADDavies, DEErtl, PFExall, AMHaley, TMHart, GJJackson, DLParry, NRPatikis, ATrivedi, NWeingarten, GGWoolven, JM Design and synthesis of pyrrolidine-5,5'-trans-lactams (5-oxo-hexahydropyrrolo[3,2-b]pyrroles) as novel mechanism-based inhibitors of human cytomegalovirus protease. 4. Antiviral activity and plasma stability. J Med Chem46:4428-49 (2003) 
 
Capsid scaffolding protein
Name:Capsid scaffolding protein
Type:PROTEIN
Mol. Mass.:73854.16
Organism:Human cytomegalovirus (strain AD169) (HHV-5) (Human herpesvirus 5)
Description:ChEMBL_158958
Residue:708
BDBM50133985
NameBDBM50133985
Synonyms:(S)-2-[(3aS,6S,6aR)-4-(6-Methoxy-benzothiazol-2-yl)-6-methyl-5-oxo-hexahydro-pyrrolo[3,2-b]pyrrole-1-carbonyl]-pyrrolidine-1-carboxylic acid (4-isopropyl-phenyl)-amide | CHEMBL139154
TypeSmall organic molecule
Emp. Form.C30H35N5O4S
Mol. Mass.561.695
SMILESCOc1ccc2nc(sc2c1)N1[C@H]2CCN([C@@H]2[C@H](C)C1=O)C(=O)[C@@H]1CCCN1C(=O)Nc1ccc(cc1)C(C)C