Reaction Details
TargetCapsid scaffolding protein
LigandBDBM50133957
Substrate/Competitorn/a
Meas. Tech.ChEMBL_158964 (CHEMBL769610)
Ki 16±n/a nM
Citation Borthwick, ADDavies, DEErtl, PFExall, AMHaley, TMHart, GJJackson, DLParry, NRPatikis, ATrivedi, NWeingarten, GGWoolven, JM Design and synthesis of pyrrolidine-5,5'-trans-lactams (5-oxo-hexahydropyrrolo[3,2-b]pyrroles) as novel mechanism-based inhibitors of human cytomegalovirus protease. 4. Antiviral activity and plasma stability. J Med Chem46:4428-49 (2003) 
 
Capsid scaffolding protein
Name:Capsid scaffolding protein
Type:PROTEIN
Mol. Mass.:73854.16
Organism:Human cytomegalovirus (strain AD169) (HHV-5) (Human herpesvirus 5)
Description:ChEMBL_158958
Residue:708
BDBM50133957
NameBDBM50133957
Synonyms:(S)-2-[(3aS,6S,6aR)-6-Methyl-4-((2R,3S)-2-(S)-methyl-3-methyl-cyclopropanecarbonyl)-5-oxo-hexahydro-pyrrolo[3,2-b]pyrrole-1-carbonyl]-pyrrolidine-1-carboxylic acid (4-isopropyl-phenyl)-amide | CHEMBL139571
TypeSmall organic molecule
Emp. Form.C28H38N4O4
Mol. Mass.494.6257
SMILESCC(C)c1ccc(NC(=O)N2CCC[C@H]2C(=O)N2CC[C@H]3[C@H]2[C@H](C)C(=O)N3C(=O)[C@H]2[C@@H](C)[C@H]2C)cc1