Reaction Details
TargetMuscarinic acetylcholine receptor M3
LigandBDBM50569299
Substrate/Competitorn/a
Meas. Tech.ChEMBL_2108812 (CHEMBL4817487)
Ki 0.251189±n/a nM
Citation Rancati, FLinney, IDRizzi, ADelcanale, MKnight, CKSchmidt, WPastore, FRiccardi, BMileo, VCarnini, CCesari, NBlackaby, WPPatacchini, RCarzaniga, L Discovery of a novel class of inhaled dual pharmacology muscarinic antagonist and ? Bioorg Med Chem Lett41:0 (2021) 
 
Muscarinic acetylcholine receptor M3
Name:Muscarinic acetylcholine receptor M3
Type:Enzyme
Mol. Mass.:66151.03
Organism:Homo sapiens (Human)
Description:P20309
Residue:590
BDBM50569299
NameBDBM50569299
Synonyms:CHEMBL4866806
TypeSmall organic molecule
Emp. Form.C51H55N5O7
Mol. Mass.850.0117
SMILESCCN(CCCNC[C@H](O)c1ccc(O)c2[nH]c(=O)ccc12)C(=O)c1ccc(COc2cccc(c2)-c2ccc(cc2)[C@@H](NC(=O)O[C@H]2CN3CCC2CC3)c2ccccc2)cc1