Reaction Details
TargetMuscarinic acetylcholine receptor M3
LigandBDBM50569300
Substrate/Competitorn/a
Meas. Tech.ChEMBL_2108812 (CHEMBL4817487)
Ki 0.125893±n/a nM
Citation Rancati, FLinney, IDRizzi, ADelcanale, MKnight, CKSchmidt, WPastore, FRiccardi, BMileo, VCarnini, CCesari, NBlackaby, WPPatacchini, RCarzaniga, L Discovery of a novel class of inhaled dual pharmacology muscarinic antagonist and ? Bioorg Med Chem Lett41:0 (2021) 
 
Muscarinic acetylcholine receptor M3
Name:Muscarinic acetylcholine receptor M3
Type:Enzyme
Mol. Mass.:66151.03
Organism:Homo sapiens (Human)
Description:P20309
Residue:590
BDBM50569300
NameBDBM50569300
Synonyms:CHEMBL4871702
TypeSmall organic molecule
Emp. Form.C56H57N5O7
Mol. Mass.912.0811
SMILESO[C@@H](CNCCCN(Cc1ccccc1)C(=O)c1ccc(COc2cccc(c2)-c2ccc(cc2)[C@@H](NC(=O)O[C@H]2CN3CCC2CC3)c2ccccc2)cc1)c1ccc(O)c2[nH]c(=O)ccc12