Reaction Details
TargetMuscarinic acetylcholine receptor M3
LigandBDBM50569302
Substrate/Competitorn/a
Meas. Tech.ChEMBL_2108812 (CHEMBL4817487)
Ki 4.0±n/a nM
Citation Rancati, FLinney, IDRizzi, ADelcanale, MKnight, CKSchmidt, WPastore, FRiccardi, BMileo, VCarnini, CCesari, NBlackaby, WPPatacchini, RCarzaniga, L Discovery of a novel class of inhaled dual pharmacology muscarinic antagonist and ? Bioorg Med Chem Lett41:0 (2021) 
 
Muscarinic acetylcholine receptor M3
Name:Muscarinic acetylcholine receptor M3
Type:Enzyme
Mol. Mass.:66151.03
Organism:Homo sapiens (Human)
Description:P20309
Residue:590
BDBM50569302
NameBDBM50569302
Synonyms:CHEMBL4878138
TypeSmall organic molecule
Emp. Form.C40H42ClN5O7
Mol. Mass.740.244
SMILESCOc1cc(C(=O)NCCN2CCC(CC2)OC(=O)Nc2ccccc2-c2ccccc2)c(Cl)cc1CNC[C@H](O)c1ccc(O)c2[nH]c(=O)ccc12