Reaction Details
TargetBeta-2 adrenergic receptor
LigandBDBM50569297
Substrate/Competitorn/a
Meas. Tech.ChEMBL_2108813 (CHEMBL4817488)
Ki 0.199526±n/a nM
Citation Rancati, FLinney, IDRizzi, ADelcanale, MKnight, CKSchmidt, WPastore, FRiccardi, BMileo, VCarnini, CCesari, NBlackaby, WPPatacchini, RCarzaniga, L Discovery of a novel class of inhaled dual pharmacology muscarinic antagonist and ? Bioorg Med Chem Lett41:0 (2021) 
 
Beta-2 adrenergic receptor
Name:Beta-2 adrenergic receptor
Type:n/a
Mol. Mass.:46461.69
Organism:Homo sapiens (Human)
Description:P07550
Residue:413
BDBM50569297
NameBDBM50569297
Synonyms:CHEMBL4846536
TypeSmall organic molecule
Emp. Form.C41H52N4O6
Mol. Mass.696.8748
SMILESO[C@@H](CNCCCCCCCCCOc1cccc(c1)C(NC(=O)O[C@H]1CN2CCC1CC2)c1ccccc1)c1ccc(O)c2[nH]c(=O)ccc12