Reaction Details
TargetBeta-2 adrenergic receptor
LigandBDBM50569290
Substrate/Competitorn/a
Meas. Tech.ChEMBL_2108813 (CHEMBL4817488)
Ki 0.012589±n/a nM
Citation Rancati, FLinney, IDRizzi, ADelcanale, MKnight, CKSchmidt, WPastore, FRiccardi, BMileo, VCarnini, CCesari, NBlackaby, WPPatacchini, RCarzaniga, L Discovery of a novel class of inhaled dual pharmacology muscarinic antagonist and ? Bioorg Med Chem Lett41:0 (2021) 
 
Beta-2 adrenergic receptor
Name:Beta-2 adrenergic receptor
Type:n/a
Mol. Mass.:46461.69
Organism:Homo sapiens (Human)
Description:P07550
Residue:413
BDBM50569290
NameBDBM50569290
Synonyms:CHEMBL4871517
TypeSmall organic molecule
Emp. Form.C49H51N5O7
Mol. Mass.821.9585
SMILESO[C@@H](CNCCCNC(=O)c1ccc(COc2cccc(c2)-c2ccc(cc2)[C@@H](NC(=O)O[C@H]2CN3CCC2CC3)c2ccccc2)cc1)c1ccc(O)c2[nH]c(=O)ccc12