Reaction Details
TargetBeta-2 adrenergic receptor
LigandBDBM50569299
Substrate/Competitorn/a
Meas. Tech.ChEMBL_2108813 (CHEMBL4817488)
Ki 0.050119±n/a nM
Citation Rancati, FLinney, IDRizzi, ADelcanale, MKnight, CKSchmidt, WPastore, FRiccardi, BMileo, VCarnini, CCesari, NBlackaby, WPPatacchini, RCarzaniga, L Discovery of a novel class of inhaled dual pharmacology muscarinic antagonist and ? Bioorg Med Chem Lett41:0 (2021) 
 
Beta-2 adrenergic receptor
Name:Beta-2 adrenergic receptor
Type:n/a
Mol. Mass.:46461.69
Organism:Homo sapiens (Human)
Description:P07550
Residue:413
BDBM50569299
NameBDBM50569299
Synonyms:CHEMBL4866806
TypeSmall organic molecule
Emp. Form.C51H55N5O7
Mol. Mass.850.0117
SMILESCCN(CCCNC[C@H](O)c1ccc(O)c2[nH]c(=O)ccc12)C(=O)c1ccc(COc2cccc(c2)-c2ccc(cc2)[C@@H](NC(=O)O[C@H]2CN3CCC2CC3)c2ccccc2)cc1