Reaction Details
TargetTubulin alpha-1A chain
LigandBDBM50134461
Substrate/Competitorn/a
Meas. Tech.ChEBML_211866
IC50>50000±n/a nM
Citation Lawrence, NJRennison, DMcGown, ATHadfield, JA The total synthesis of an aurone isolated from Uvaria hamiltonii: aurones and flavones as anticancer agents. Bioorg Med Chem Lett13:3759-63 (2003) Tubulin alpha-1A chain
Name:Tubulin alpha-1A chain
Type:Protein
Mol. Mass.:50049.25
Organism:Sus scrofa (Pig)
Description:P02550
Residue:451
BDBM50134461
NameBDBM50134461
Synonyms:2-(3-Hydroxy-4-methoxy-phenyl)-5,6,7-trimethoxy-chromen-4-one eupatorin-5-methylether
TypeSmall organic molecule
Emp. Form.C19H18O7
Mol. Mass.358.342
SMILESCOc1ccc(cc1O)-c1cc(=O)c2c(OC)c(OC)c(OC)cc2o1