Reaction Details
TargetD(3) dopamine receptor
LigandBDBM21398
Substrate/Competitorn/a
Meas. Tech.ChEMBL_62590 (CHEMBL673118)
Ki 4.6±n/a nM
Citation Sikazwe, DMLi, SLyles-Eggleston, MAblordeppey, SY The acute EPS of haloperidol may be unrelated to its metabolic transformation to BCPP+. Bioorg Med Chem Lett13:3779-82 (2003) D(3) dopamine receptor
Name:D(3) dopamine receptor
Type:n/a
Mol. Mass.:44243.43
Organism:Homo sapiens (Human)
Description:n/a
Residue:400
BDBM21398
NameBDBM21398
Synonyms:4-[4-(4-Chloro-phenyl)-4-hydroxy-piperidin-1-yl]-1-(4-fluoro-phenyl)-butan-1-one;propionate(HCl) CHEMBL54 Haloperidol | Haloperidol, 1
TypeSmall organic molecule
Emp. Form.C21H23ClFNO2
Mol. Mass.375.864
SMILESOC1(CCN(CCCC(=O)c2ccc(F)cc2)CC1)c1ccc(Cl)cc1