Reaction Details
TargetIntegrin alpha-V/beta-3
LigandBDBM50134778
Substrate/Competitorn/a
Meas. Tech.ChEMBL_217805 (CHEMBL823261)
IC50 0.08±n/a nM
Citation Hutchinson, JHHalczenko, WBrashear, KMBreslin, MJColeman, PJDuong, le TFernandez-Metzler, CGentile, MAFisher, JEHartman, GDHuff, JRKimmel, DBLeu, CTMeissner, RSMerkle, KNagy, RPennypacker, BPerkins, JJPrueksaritanont, TRodan, GAVarga, SLWesolowski, GAZartman, AERodan, SBDuggan, ME Nonpeptide alphavbeta3 antagonists. 8. In vitro and in vivo evaluation of a potent alphavbeta3 antagonist for the prevention and treatment of osteoporosis. J Med Chem46:4790-8 (2003) 
 
Integrin alpha-V/beta-3
Name:Integrin alpha-V/beta-3
Type:Enzyme
Mol. Mass.:n/a
Description:n/a
Components:This complex has 2 components.
Component 1
Name:Integrin alpha-V
Synonyms:ITAV_HUMAN Integrin alpha-V/alpha-5 VNRA Vitronectin receptor | Vitronectin receptor subunit alpha
Type:PROTEIN
Mol. Mass.:116024.92
Organism:Homo sapiens (Human)
Description:ChEMBL_582336
Residue:1048
Component 2
Name:Integrin beta-3
Synonyms:CD_antigen=CD61 GPIIIa ITGB3 Platelet membrane glycoprotein IIIa
Type:Protein
Mol. Mass.:87038.91
Organism:Homo sapiens (Human)
Description:P05106
Residue:788
BDBM50134778
NameBDBM50134778
Synonyms:(S)-3-(6-Methoxy-pyridin-3-yl)-3-{2-oxo-3-[3-(5,6,7,8-tetrahydro-[1,8]naphthyridin-2-yl)-propyl]-imidazolidin-1-yl}-propionic acid CHEMBL145085 | US11685738, Compound A30s
TypeSmall organic molecule
Emp. Form.C23H29N5O4
Mol. Mass.439.5075
SMILESCOc1ccc(cn1)[C@H](CC(O)=O)N1CCN(CCCc2ccc3CCCNc3n2)C1=O