Reaction Details
TargetP2Y purinoceptor 1
LigandBDBM50134966
Substrate/Competitorn/a
Meas. Tech.ChEMBL_147583 (CHEMBL750161)
Ki 12.6±n/a nM
Citation Kim, HSOhno, MXu, BKim, HOChoi, YJi, XDMaddileti, SMarquez, VEHarden, TKJacobson, KA 2-Substitution of adenine nucleotide analogues containing a bicyclo[3.1.0]hexane ring system locked in a northern conformation: enhanced potency as P2Y1 receptor antagonists. J Med Chem46:4974-87 (2003) 
 
P2Y purinoceptor 1
Name:P2Y purinoceptor 1
Type:Enzyme
Mol. Mass.:42090.25
Organism:Homo sapiens (Human)
Description:P47900
Residue:373
BDBM50134966
NameBDBM50134966
Synonyms:CHEMBL343651 | Phosphoric acid mono-[(1R,5S)-4-(6-amino-2-iodo-purin-9-yl)-1-phosphonooxymethyl-bicyclo[3.1.0]hex-2-yl] ester
TypeSmall organic molecule
Emp. Form.C12H16IN5O8P2
Mol. Mass.547.1361
SMILESNc1nc(I)nc2n(cnc12)C1CC(OP(O)(O)=O)[C@]2(COP(O)(O)=O)C[C@H]12