Reaction Details
TargetDihydrofolate reductase
LigandBDBM50135139
Substrate/Competitorn/a
Meas. Tech.ChEMBL_52861 (CHEMBL884363)
IC50 110±n/a nM
Citation Gangjee, AAdair, OOQueener, SF Synthesis and biological evaluation of 2,4-diamino-6-(arylaminomethyl)pyrido[2,3-d]pyrimidines as inhibitors of Pneumocystis carinii and Toxoplasma gondii dihydrofolate reductase and as antiopportunistic infection and antitumor agents. J Med Chem46:5074-82 (2003) 
 
Dihydrofolate reductase
Name:Dihydrofolate reductase
Type:Enzyme
Mol. Mass.:17991.61
Organism:Escherichia coli
Description:E. coli DHFR was expressed in BL21, and purified to homogeneity.
Residue:159
BDBM50135139
NameBDBM50135139
Synonyms:6-{[(3,4-Dichloro-phenyl)-methyl-amino]-methyl}-pyrido[2,3-d]pyrimidine-2,4-diamine | CHEMBL147828
TypeSmall organic molecule
Emp. Form.C15H14Cl2N6
Mol. Mass.349.218
SMILESCN(Cc1cnc2nc(N)nc(N)c2c1)c1ccc(Cl)c(Cl)c1