Reaction Details
TargetChymotrypsin-C
LigandBDBM50135495
Substrate/Competitorn/a
Meas. Tech.ChEBML_49615
IC50>1000±n/a nM
Citation Masaki, HMizuno, YTatui, AMurakami, AKoide, YSatoh, STakahashi, A Structure-activity relationship of benzo[b]thiophene-2-sulfonamide derivatives as novel human chymase inhibitors. Bioorg Med Chem Lett13:4085-8 (2003) Chymotrypsin-C
Name:Chymotrypsin-C
Type:Enzyme
Mol. Mass.:29487.98
Organism:Homo sapiens (Human)
Description:Q99895
Residue:268
BDBM50135495
NameBDBM50135495
Synonyms:4-(5-Chloro-3-methyl-benzo[b]thiophene-2-sulfonylamino)-3-methanesulfonyl-benzoic acid methyl ester | CHEMBL129879
TypeSmall organic molecule
Emp. Form.C18H16ClNO6S3
Mol. Mass.473.971
SMILESCOC(=O)c1ccc(NS(=O)(=O)c2sc3ccc(Cl)cc3c2C)c(c1)S(C)(=O)=O