Reaction Details
TargetChymase
LigandBDBM50135499
Substrate/Competitorn/a
Meas. Tech.ChEBML_49439
IC50 159±n/a nM
Citation Masaki, HMizuno, YTatui, AMurakami, AKoide, YSatoh, STakahashi, A Structure-activity relationship of benzo[b]thiophene-2-sulfonamide derivatives as novel human chymase inhibitors. Bioorg Med Chem Lett13:4085-8 (2003) Chymase
Name:Chymase
Type:Enzyme
Mol. Mass.:27340.12
Organism:Homo sapiens (Human)
Description:n/a
Residue:247
BDBM50135499
NameBDBM50135499
Synonyms:2-[4-(5-Fluoro-3-methyl-benzo[b]thiophene-2-sulfonylamino)-3-methanesulfonyl-benzoylamino]-3-hydroxy-propionic acid | CHEMBL131605
TypeSmall organic molecule
Emp. Form.C20H19FN2O8S3
Mol. Mass.530.567
SMILESCc1c(sc2ccc(F)cc12)S(=O)(=O)Nc1ccc(cc1S(C)(=O)=O)C(=O)NC(CO)C(O)=O