Reaction Details
TargetVascular endothelial growth factor receptor 2
LigandBDBM50024274
Substrate/Competitorn/a
Meas. Tech.ChEMBL_213978 (CHEMBL817492)
IC50 12±n/a nM
Citation Gingrich, DEReddy, DRIqbal, MASingh, JAimone, LDAngeles, TSAlbom, MYang, SAtor, MAMeyer, SLRobinson, CRuggeri, BADionne, CAVaught, JLMallamo, JPHudkins, RL A new class of potent vascular endothelial growth factor receptor tyrosine kinase inhibitors: structure-activity relationships for a series of 9-alkoxymethyl-12-(3-hydroxypropyl)indeno[2,1-a]pyrrolo[3,4-c]carbazole-5-ones and the identification of CEP-5214 and its dimethylglycine ester prodrug clin J Med Chem46:5375-88 (2003) 
 
Vascular endothelial growth factor receptor 2
Name:Vascular endothelial growth factor receptor 2
Type:Receptor Tyrosine Kinase
Mol. Mass.:151510.97
Organism:Homo sapiens (Human)
Description:P35968
Residue:1356
BDBM50024274
NameBDBM50024274
Synonyms:CHEMBL2448133
TypeSmall organic molecule
Emp. Form.C29H30N2O3
Mol. Mass.454.5601
SMILESCC[C@@H](C)OCc1ccc2n(CCCO)c3c4Cc5ccccc5-c4c4C(=O)NCc4c3c2c1