Reaction Details
TargetProtein kinase C alpha/beta/gamma type
LigandBDBM50136008
Substrate/Competitorn/a
Meas. Tech.ChEMBL_162381 (CHEMBL767469)
IC50>10000±n/a nM
Citation Gingrich, DEReddy, DRIqbal, MASingh, JAimone, LDAngeles, TSAlbom, MYang, SAtor, MAMeyer, SLRobinson, CRuggeri, BADionne, CAVaught, JLMallamo, JPHudkins, RL A new class of potent vascular endothelial growth factor receptor tyrosine kinase inhibitors: structure-activity relationships for a series of 9-alkoxymethyl-12-(3-hydroxypropyl)indeno[2,1-a]pyrrolo[3,4-c]carbazole-5-ones and the identification of CEP-5214 and its dimethylglycine ester prodrug clin J Med Chem46:5375-88 (2003) 
 
Protein kinase C alpha/beta/gamma type
Name:Protein kinase C alpha/beta/gamma type
Synonyms:Protein kinase C, PKC; classical
Type:n/a
Mol. Mass.:n/a
Description:ASSAY_ID of ChEMBL is 162381
Components:This complex has 3 components.
Component 1
Name:Protein kinase C alpha type
Type:Protein
Mol. Mass.:76797.67
Organism:Rattus norvegicus (Rat)
Description:P05696
Residue:672
Component 2
Name:Protein kinase C beta type
Synonyms:KPCB_RAT Pkcb Prkcb1 Protein kinase C (PKC) | Protein kinase C beta
Type:Enzyme Mixture
Mol. Mass.:76755.54
Organism:Rattus norvegicus (rat)
Description:PKC from rat brain is known to contain predominately the conventional PKC isoforms, alpha, beta I, beta II, gamma.
Residue:671
Component 3
Name:Protein kinase C gamma type
Synonyms:KPCG_RAT Pkcg Prkcg Protein kinase C gamma
Type:PROTEIN
Mol. Mass.:78367.88
Organism:Rattus norvegicus
Description:ChEMBL_152979
Residue:697
BDBM50136008
NameBDBM50136008
Synonyms:12-(3-hydroxypropyl)-9-isopropoxymethyl-6,7,12,13-tetrahydro-5H-indeno[2,1-a]pyrrolo[4,3-c]carbazol-5-one | CHEMBL150894
TypeSmall organic molecule
Emp. Form.C28H28N2O3
Mol. Mass.440.5335
SMILESCC(C)OCc1ccc2n(CCCO)c3c4Cc5ccccc5-c4c4C(=O)NCc4c3c2c1