Reaction Details
Target5'-nucleotidase
LigandBDBM50523547
Substrate/Competitorn/a
Meas. Tech.ChEMBL_2114161 (CHEMBL4823011)
IC50 257±n/a nM
Citation Oliva, PScortichini, MDobelmann, CJain, SGopinatth, VToti, KSPhung, NBJunker, AJacobson, KA Structure-activity relationships of pyrimidine nucleotides containing a 5'-?,?-methylene diphosphonate at the P2Y Bioorg Med Chem Lett45:0 (2021) 
 
5'-nucleotidase
Name:5'-nucleotidase
Type:Enzyme
Mol. Mass.:63971.44
Organism:Rattus norvegicus (Rat)
Description:P21588
Residue:576
BDBM50523547
NameBDBM50523547
Synonyms:CHEMBL1198873
TypeSmall organic molecule
Emp. Form.C11H19N3O11P2
Mol. Mass.431.2296
SMILESCO\N=c1\ccn([C@@H]2O[C@H](COP(O)(=O)CP(O)(O)=O)[C@@H](O)[C@H]2O)c(=O)[nH]1