Reaction Details
Target5'-nucleotidase
LigandBDBM50523521
Substrate/Competitorn/a
Meas. Tech.ChEMBL_2114161 (CHEMBL4823011)
IC50 112±n/a nM
Citation Oliva, PScortichini, MDobelmann, CJain, SGopinatth, VToti, KSPhung, NBJunker, AJacobson, KA Structure-activity relationships of pyrimidine nucleotides containing a 5'-?,?-methylene diphosphonate at the P2Y Bioorg Med Chem Lett45:0 (2021) 
 
5'-nucleotidase
Name:5'-nucleotidase
Type:Enzyme
Mol. Mass.:63971.44
Organism:Rattus norvegicus (Rat)
Description:P21588
Residue:576
BDBM50523521
NameBDBM50523521
Synonyms:CHEMBL4299847
TypeSmall organic molecule
Emp. Form.C17H23N3O11P2
Mol. Mass.507.3255
SMILESO[C@@H]1[C@@H](COP(O)(=O)CP(O)(O)=O)O[C@H]([C@@H]1O)n1cc\c(=N\OCc2ccccc2)[nH]c1=O