Reaction Details
TargetMelatonin receptor type 1B
LigandBDBM50136402
Substrate/Competitorn/a
Meas. Tech.ChEBML_105266
Ki 0.310000±n/a nM
Citation Sun, LQChen, JMattson, RJEpperson, JRDeskus, JALi, WSTakaki, KHodges, DBIben, LMahle, CDOrtiz, AMolstad, DRyan, EYeleswaram, KXu, CLuo, G Heterocyclic aminopyrrolidine derivatives as melatoninergic agents. Bioorg Med Chem Lett13:4381-4 (2003) Melatonin receptor type 1B
Name:Melatonin receptor type 1B
Type:Enzyme
Mol. Mass.:40203.54
Organism:Homo sapiens (Human)
Description:P49286
Residue:362
BDBM50136402
NameBDBM50136402
Synonyms:CHEMBL136531 | N-[(S)-1-(2,3-Dihydro-benzofuran-4-yl)-pyrrolidin-3-yl]-butyramide
TypeSmall organic molecule
Emp. Form.C16H22N2O2
Mol. Mass.274.3581
SMILESCCCC(=O)N[C@H]1CCN(C1)c1cccc2OCCc12