Reaction Details
Target5-hydroxytryptamine receptor 2C
LigandBDBM50136498
Substrate/Competitorn/a
Meas. Tech.ChEBML_2828
Ki 26±n/a nM
Citation Grella, BTeitler, MSmith, CHerrick-Davis, KGlennon, RA Binding of beta-carbolines at 5-HT(2) serotonin receptors. Bioorg Med Chem Lett13:4421-5 (2003) 5-hydroxytryptamine receptor 2C
Name:5-hydroxytryptamine receptor 2C
Type:Enzyme
Mol. Mass.:51935.10
Organism:Rattus norvegicus (Rat)
Description:P08909
Residue:460
BDBM50136498
NameBDBM50136498
Synonyms:5-Isopropoxy-1-methyl-4,9-dihydro-3H-beta-carboline | CHEMBL343079
TypeSmall organic molecule
Emp. Form.C15H18N2O
Mol. Mass.242.3162
SMILESCC(C)Oc1cccc2[nH]c3c(CCN=C3C)c12