Reaction Details
Target5-hydroxytryptamine receptor 2A
LigandBDBM50136501
Substrate/Competitorn/a
Meas. Tech.ChEMBL_2640 (CHEMBL618695)
Ki 80±n/a nM
Citation Grella, BTeitler, MSmith, CHerrick-Davis, KGlennon, RA Binding of beta-carbolines at 5-HT(2) serotonin receptors. Bioorg Med Chem Lett13:4421-5 (2003) 5-hydroxytryptamine receptor 2A
Name:5-hydroxytryptamine receptor 2A
Type:G Protein-Coupled Receptor (GPCR)
Mol. Mass.:52852.05
Organism:Rattus norvegicus (rat)
Description:Rat cortex membranes 5-HT2A receptors.
Residue:471
BDBM50136501
NameBDBM50136501
Synonyms:5-Bromo-2,3,4,9-tetrahydro-1H-beta-carboline | CHEMBL6426
TypeSmall organic molecule
Emp. Form.C11H11BrN2
Mol. Mass.251.122
SMILESBrc1cccc2[nH]c3CNCCc3c12