Reaction Details
Target5-hydroxytryptamine receptor 5A
LigandBDBM100152
Substrate/Competitorn/a
Meas. Tech.ChEBML_3583
Ki>10000±n/a nM
Citation Grella, BTeitler, MSmith, CHerrick-Davis, KGlennon, RA Binding of beta-carbolines at 5-HT(2) serotonin receptors. Bioorg Med Chem Lett13:4421-5 (2003) 5-hydroxytryptamine receptor 5A
Name:5-hydroxytryptamine receptor 5A
Type:Enzyme
Mol. Mass.:40266.25
Organism:Homo sapiens (Human)
Description:P47898
Residue:357
BDBM100152
NameBDBM100152
Synonyms:7-methoxy-1-methyl-9H-beta-carboline;hydrochloride HARMINE MLS002153910 cid_5359389
TypeSmall organic molecule
Emp. Form.C13H12N2O
Mol. Mass.212.2472
SMILESCOc1ccc2c(c1)[nH]c1c(C)nccc21