Reaction Details
TargetSodium-dependent serotonin transporter
LigandBDBM50136677
Substrate/Competitorn/a
Meas. Tech.ChEBML_201368
Ki 10±n/a nM
Citation Bymaster, FPBeedle, EEFindlay, JGallagher, PTKrushinski, JHMitchell, SRobertson, DWThompson, DCWallace, LWong, DT Duloxetine (Cymbalta), a dual inhibitor of serotonin and norepinephrine reuptake. Bioorg Med Chem Lett13:4477-80 (2003) Sodium-dependent serotonin transporter
Name:Sodium-dependent serotonin transporter
Type:Multi-pass membrane protein
Mol. Mass.:70322.51
Organism:Homo sapiens (Human)
Description:P31645
Residue:630
BDBM50136677
NameBDBM50136677
Synonyms:CHEMBL334929 | Methyl-[3-(naphthalen-1-yloxy)-3-(2-trifluoromethyl-phenyl)-propyl]-amine
TypeSmall organic molecule
Emp. Form.C21H20F3NO
Mol. Mass.359.3848
SMILESCNCCC(Oc1cccc2ccccc12)c1ccccc1C(F)(F)F