Reaction Details
TargetSodium-dependent noradrenaline transporter
LigandBDBM50136680
Substrate/Competitorn/a
Meas. Tech.ChEBML_142612
Ki 20±n/a nM
Citation Bymaster, FPBeedle, EEFindlay, JGallagher, PTKrushinski, JHMitchell, SRobertson, DWThompson, DCWallace, LWong, DT Duloxetine (Cymbalta), a dual inhibitor of serotonin and norepinephrine reuptake. Bioorg Med Chem Lett13:4477-80 (2003) Sodium-dependent noradrenaline transporter
Name:Sodium-dependent noradrenaline transporter
Type:Multi-pass membrane protein
Mol. Mass.:69337.72
Organism:Homo sapiens (Human)
Description:P23975
Residue:617
BDBM50136680
NameBDBM50136680
Synonyms:CHEMBL424660 N-methyl-3-(naphthalen-1-yloxy)-3-(2-thienyl)propan-1-amine | duloxetine
TypeSmall organic molecule
Emp. Form.C18H19NOS
Mol. Mass.297.415
SMILESCNCCC(Oc1cccc2ccccc12)c1cccs1