Reaction Details
TargetSodium-dependent serotonin transporter
LigandBDBM50136683
Substrate/Competitorn/a
Meas. Tech.ChEBML_201368
Ki 1.1±n/a nM
Citation Bymaster, FPBeedle, EEFindlay, JGallagher, PTKrushinski, JHMitchell, SRobertson, DWThompson, DCWallace, LWong, DT Duloxetine (Cymbalta), a dual inhibitor of serotonin and norepinephrine reuptake. Bioorg Med Chem Lett13:4477-80 (2003) Sodium-dependent serotonin transporter
Name:Sodium-dependent serotonin transporter
Type:Multi-pass membrane protein
Mol. Mass.:70322.51
Organism:Homo sapiens (Human)
Description:P31645
Residue:630
BDBM50136683
NameBDBM50136683
Synonyms:CHEMBL142028 | Methyl-[3-(naphthalen-1-yloxy)-3-thiophen-3-yl-propyl]-amine
TypeSmall organic molecule
Emp. Form.C18H19NOS
Mol. Mass.297.415
SMILESCNCCC(Oc1cccc2ccccc12)c1ccsc1