Reaction Details
TargetHistone deacetylase 1
LigandBDBM50398716
Substrate/Competitorn/a
Meas. Tech.ChEMBL_2114939 (CHEMBL4823880)
IC50 5.1±n/a nM
Citation Shen, SPicci, CUstinova, KBenoy, VKutil, ZZhang, GTavares, MTPavlí?ek, JZimprich, CARobers, MBVan Den Bosch, LBa?inka, CLangley, BKozikowski, AP Tetrahydroquinoline-Capped Histone Deacetylase 6 Inhibitor SW-101 Ameliorates Pathological Phenotypes in a Charcot-Marie-Tooth Type 2A Mouse Model. J Med Chem64:4810-4840 (2021) 
 
Histone deacetylase 1
Name:Histone deacetylase 1
Type:Enzyme
Mol. Mass.:55090.27
Organism:Homo sapiens (Human)
Description:Q13547
Residue:482
BDBM50398716
NameBDBM50398716
Synonyms:CHEMBL2179618 US9409858, 5g US9956192, Compound 5g
TypeSmall organic molecule
Emp. Form.C19H23N3O3
Mol. Mass.341.4042
SMILESCCCCN(Cc1ccc(cc1)C(=O)NO)C(=O)Nc1ccccc1