Reaction Details
TargetHistone deacetylase 6
LigandBDBM417049
Substrate/Competitorn/a
Meas. Tech.ChEMBL_2114965 (CHEMBL4823906)
EC50 160±n/a nM
Citation Shen, SPicci, CUstinova, KBenoy, VKutil, ZZhang, GTavares, MTPavlí?ek, JZimprich, CARobers, MBVan Den Bosch, LBa?inka, CLangley, BKozikowski, AP Tetrahydroquinoline-Capped Histone Deacetylase 6 Inhibitor SW-101 Ameliorates Pathological Phenotypes in a Charcot-Marie-Tooth Type 2A Mouse Model. J Med Chem64:4810-4840 (2021) 
 
Histone deacetylase 6
Name:Histone deacetylase 6
Type:Chromatin regulator; hydrolase; repressor
Mol. Mass.:131381.51
Organism:Homo sapiens (Human)
Description:Q9UBN7
Residue:1215
BDBM417049
NameBDBM417049
Synonyms:4-((6-chloro-3,4-dihydroquinolin-1(2H)-yl)methyl)-N-hydroxybenzamide | US10456394, Example 2
TypeSmall organic molecule
Emp. Form.C17H17ClN2O2
Mol. Mass.316.782
SMILESONC(=O)c1ccc(CN2CCCc3cc(Cl)ccc23)cc1