Reaction Details
TargetHistone deacetylase 6
LigandBDBM50571528
Substrate/Competitorn/a
Meas. Tech.ChEMBL_2114965 (CHEMBL4823906)
EC50 140±n/a nM
Citation Shen, SPicci, CUstinova, KBenoy, VKutil, ZZhang, GTavares, MTPavlí?ek, JZimprich, CARobers, MBVan Den Bosch, LBa?inka, CLangley, BKozikowski, AP Tetrahydroquinoline-Capped Histone Deacetylase 6 Inhibitor SW-101 Ameliorates Pathological Phenotypes in a Charcot-Marie-Tooth Type 2A Mouse Model. J Med Chem64:4810-4840 (2021) 
 
Histone deacetylase 6
Name:Histone deacetylase 6
Type:Chromatin regulator; hydrolase; repressor
Mol. Mass.:131381.51
Organism:Homo sapiens (Human)
Description:Q9UBN7
Residue:1215
BDBM50571528
NameBDBM50571528
Synonyms:CHEMBL4846435
TypeSmall organic molecule
Emp. Form.C18H19N3O3
Mol. Mass.325.3618
SMILESNC(=O)c1ccc2N(Cc3ccc(cc3)C(=O)NO)CCCc2c1