Reaction Details
TargetHistone deacetylase 6
LigandBDBM50380399
Substrate/Competitorn/a
Meas. Tech.ChEMBL_2114965 (CHEMBL4823906)
EC50 1090±n/a nM
Citation Shen, SPicci, CUstinova, KBenoy, VKutil, ZZhang, GTavares, MTPavlí?ek, JZimprich, CARobers, MBVan Den Bosch, LBa?inka, CLangley, BKozikowski, AP Tetrahydroquinoline-Capped Histone Deacetylase 6 Inhibitor SW-101 Ameliorates Pathological Phenotypes in a Charcot-Marie-Tooth Type 2A Mouse Model. J Med Chem64:4810-4840 (2021) 
 
Histone deacetylase 6
Name:Histone deacetylase 6
Type:Chromatin regulator; hydrolase; repressor
Mol. Mass.:131381.51
Organism:Homo sapiens (Human)
Description:Q9UBN7
Residue:1215
BDBM50380399
NameBDBM50380399
Synonyms:CHEMBL2018302 US10227295, Compound Tubastatin A US11207431, Example D US9249087, Tubacin US9956192, Compound Tubastatin-A
TypeSmall organic molecule
Emp. Form.C20H21N3O2
Mol. Mass.335.3996
SMILESCN1CCc2c(C1)c1ccccc1n2Cc1ccc(cc1)C(=O)NO