Reaction Details
TargetBromodomain-containing protein 4
LigandBDBM188517
Substrate/Competitorn/a
Meas. Tech.ChEMBL_2115129 (CHEMBL4824070)
IC50 18100±n/a nM
Citation Muthengi, AWimalasena, VKYosief, HOBikowitz, MJSigua, LHWang, TLi, DGaieb, ZDhawan, GLiu, SErickson, JAmaro, RESchönbrunn, EQi, JZhang, W Development of Dimethylisoxazole-Attached Imidazo[1,2- J Med Chem64:5787-5801 (2021) 
 
Bromodomain-containing protein 4
Name:Bromodomain-containing protein 4
Type:Protein
Mol. Mass.:152264.84
Organism:Homo sapiens (Human)
Description:O60885
Residue:1362
BDBM188517
NameBDBM188517
Synonyms:PF-CBP1
TypeSmall organic molecule
Emp. Form.C29H36N4O3
Mol. Mass.488.6211
SMILESCCCOc1ccc(CCc2nc3cc(ccc3n2CCN2CCOCC2)-c2c(C)noc2C)cc1