Reaction Details
TargetSomatostatin receptor type 4
LigandBDBM50136788
Substrate/Competitorn/a
Meas. Tech.ChEMBL_200836 (CHEMBL807046)
IC50 1.5±n/a nM
Citation Erchegyi, JWaser, BSchaer, JCCescato, RBrazeau, JFRivier, JReubi, JC Novel sst(4)-selective somatostatin (SRIF) agonists. 3. Analogues amenable to radiolabeling. J Med Chem46:5597-605 (2003) 
 
Somatostatin receptor type 4
Name:Somatostatin receptor type 4
Type:Enzyme
Mol. Mass.:42015.38
Organism:Homo sapiens (Human)
Description:P31391
Residue:388
BDBM50136788
NameBDBM50136788
Synonyms:(4R,7S,10S,13S,16S,19S,22R,25S)-19-(4-Amino-benzyl)-13-(4-amino-butyl)-7,22-dibenzyl-10-((S)-1-hydroxy-ethyl)-16-(1H-indol-3-ylmethyl)-6,9,12,15,18,21,24-heptaoxo-25-ureido-1,2-dithia-5,8,11,14,17,20,23-heptaaza-cyclohexacosane-4-carboxylic acid | CHEMBL407436
TypeSmall organic molecule
Emp. Form.C55H68N12O11S2
Mol. Mass.1137.332
SMILESC[C@H](O)[C@@H]1NC(=O)[C@H](CCCCN)NC(=O)[C@H](Cc2c[nH]c3ccccc23)NC(=O)[C@H](Cc2ccc(N)cc2)NC(=O)[C@@H](Cc2ccccc2)NC(=O)[C@@H](CSSC[C@H](NC(=O)[C@H](Cc2ccccc2)NC1=O)C(O)=O)NC(N)=O