Reaction Details
TargetSomatostatin receptor type 1
LigandBDBM50136791
Substrate/Competitorn/a
Meas. Tech.ChEMBL_200537 (CHEMBL805041)
IC50 450±n/a nM
Citation Erchegyi, JWaser, BSchaer, JCCescato, RBrazeau, JFRivier, JReubi, JC Novel sst(4)-selective somatostatin (SRIF) agonists. 3. Analogues amenable to radiolabeling. J Med Chem46:5597-605 (2003) 
 
Somatostatin receptor type 1
Name:Somatostatin receptor type 1
Type:Enzyme
Mol. Mass.:42692.81
Organism:Homo sapiens (Human)
Description:P30872
Residue:391
BDBM50136791
NameBDBM50136791
Synonyms:(S)-25-Amino-19-(4-amino-benzyl)-13-(4-amino-butyl)-7,22-dibenzyl-10-((S)-1-hydroxy-ethyl)-16-(1H-indol-3-ylmethyl)-6,9,12,15,18-penta(S)-oxo-21-(R)-oxo-24-oxo-1,2-dithia-5,8,11,14,17,20,23-heptaaza-cyclohexacosane-4-carboxylic acid | CHEMBL439902
TypeSmall organic molecule
Emp. Form.C54H67N11O10S2
Mol. Mass.1094.307
SMILESC[C@H](O)[C@@H]1NC(=O)[C@H](CCCCN)NC(=O)[C@H](Cc2c[nH]c3ccccc23)NC(=O)[C@H](Cc2ccc(N)cc2)NC(=O)[C@@H](Cc2ccccc2)NC(=O)[C@H](N)CSSC[C@H](NC(=O)[C@H](Cc2ccccc2)NC1=O)C(O)=O