Reaction Details
TargetSomatostatin receptor type 4
LigandBDBM50136824
Substrate/Competitorn/a
Meas. Tech.ChEMBL_200837 (CHEMBL807047)
IC50 1.8±n/a nM
Citation Grace, CRKoerber, SCErchegyi, JReubi, JCRivier, JRiek, R Novel sst(4)-selective somatostatin (SRIF) agonists. 4. Three-dimensional consensus structure by NMR. J Med Chem46:5606-18 (2003) 
 
Somatostatin receptor type 4
Name:Somatostatin receptor type 4
Type:Enzyme
Mol. Mass.:42015.38
Organism:Homo sapiens (Human)
Description:P31391
Residue:388
BDBM50136824
NameBDBM50136824
Synonyms:(4R,7S,10S,13S,16R,19S,22S,25R)-16-((1H-indol-3-yl)methyl)-25-amino-13-(4-aminobutyl)-7,19,22-tribenzyl-10-((R)-1-hydroxyethyl)-6,9,12,15,18,21,24-heptaoxo-1,2-dithia-5,8,11,14,17,20,23-heptaazacyclohexacosane-4-carboxylic acid CHEMBL266477 ODT-8
TypeSmall organic molecule
Emp. Form.C54H66N10O10S2
Mol. Mass.1079.293
SMILESC[C@@H](O)[C@H]1NC(=O)[C@H](CCCCN)NC(=O)[C@H](Cc2c[nH]c3ccccc23)NC(=O)[C@H](Cc2ccccc2)NC(=O)[C@@H](Cc2ccccc2)NC(=O)[C@H](N)CSSC[C@H](NC(=O)[C@H](Cc2ccccc2)NC1=O)C(O)=O