Reaction Details
TargetReverse transcriptase/RNaseH
LigandBDBM50137102
Substrate/Competitorn/a
Meas. Tech.ChEMBL_196363 (CHEMBL805996)
IC50 13300±n/a nM
Citation Behforouz, MCai, WStocksdale, MGLucas, JSJung, JYBriere, DWang, AKaten, KSBehforouz, NC Novel lavendamycin analogues as potent HIV-reverse transcriptase inhibitors: synthesis and evaluation of anti-reverse transcriptase activity of amide and ester analogues of lavendamycin. J Med Chem46:5773-80 (2003) 
 
Reverse transcriptase/RNaseH
Name:Reverse transcriptase/RNaseH
Type:PROTEIN
Mol. Mass.:65229.15
Organism:Human immunodeficiency virus 1
Description:ChEMBL_1473730
Residue:566
BDBM50137102
NameBDBM50137102
Synonyms:1-(7-Acetylamino-5,8-dioxo-5,8-dihydro-quinolin-2-yl)-9H-beta-carboline-3-carboxylic acid | CHEMBL346794
TypeSmall organic molecule
Emp. Form.C23H14N4O5
Mol. Mass.426.3811
SMILESCC(=O)NC1=CC(=O)c2ccc(nc2C1=O)-c1[nH]c(cc2c1nc1ccccc21)C(O)=O