Reaction Details
TargetGlutamate receptor 3
LigandBDBM50137125
Substrate/Competitorn/a
Meas. Tech.ChEMBL_90290 (CHEMBL697509)
IC50>100000±n/a nM
Citation Valgeirsson, JNielsen, EŘPeters, DVarming, TMathiesen, CKristensen, ASMadsen, U 2-arylureidobenzoic acids: selective noncompetitive antagonists for the homomeric kainate receptor subtype GluR5. J Med Chem46:5834-43 (2003) 
 
Glutamate receptor 3
Name:Glutamate receptor 3
Type:PROTEIN
Mol. Mass.:101172.14
Organism:Homo sapiens (Human)
Description:ChEMBL_468627
Residue:894
BDBM50137125
NameBDBM50137125
Synonyms:2-(3-(3-bromophenyl)ureido)-4-chlorobenzoic acid CHEMBL154700
TypeSmall organic molecule
Emp. Form.C14H10BrClN2O3
Mol. Mass.369.598
SMILESOC(=O)c1ccc(Cl)cc1NC(=O)Nc1cccc(Br)c1