Reaction Details
TargetGlutamate receptor 3
LigandBDBM50137124
Substrate/Competitorn/a
Meas. Tech.ChEMBL_90290 (CHEMBL697509)
IC50>100000±n/a nM
Citation Valgeirsson, JNielsen, EŘPeters, DVarming, TMathiesen, CKristensen, ASMadsen, U 2-arylureidobenzoic acids: selective noncompetitive antagonists for the homomeric kainate receptor subtype GluR5. J Med Chem46:5834-43 (2003) 
 
Glutamate receptor 3
Name:Glutamate receptor 3
Type:PROTEIN
Mol. Mass.:101172.14
Organism:Homo sapiens (Human)
Description:ChEMBL_468627
Residue:894
BDBM50137124
NameBDBM50137124
Synonyms:4-Chloro-2-(3-naphthalen-2-yl-ureido)-benzoic acid CHEMBL346524
TypeSmall organic molecule
Emp. Form.C18H13ClN2O3
Mol. Mass.340.76
SMILESOC(=O)c1ccc(Cl)cc1NC(=O)Nc1ccc2ccccc2c1