Reaction Details
TargetGlucagon-like peptide 1 receptor
LigandBDBM50571854
Substrate/Competitorn/a
Meas. Tech.ChEMBL_2115840 (CHEMBL4824781)
EC50 0.0016±n/a nM
Citation Zhang, JDong, YJu, DFeng, J Design, synthesis and biological evaluation of double fatty chain-modified glucagon-like peptide-1 conjugates. Bioorg Med Chem44:0 (2021) 
 
Glucagon-like peptide 1 receptor
Name:Glucagon-like peptide 1 receptor
Type:Enzyme
Mol. Mass.:53035.78
Organism:Homo sapiens (Human)
Description:P43220
Residue:463
BDBM50571854
NameBDBM50571854
Synonyms:CHEMBL4870050
TypeSmall organic molecule
Emp. Form.C62H113N7O19
Mol. Mass.1260.5961
(=O)N[C@@H](CCC(=O)NCCCC[C@H](NC(=O)CC[C@H](NC(=O)CCCCCCCCCCCCC)C(O)=O)C(=O)NCCOCCOCC(=O)NCCOCCOCC(=O)NCCOCCOCC(O)=O)C(O)=O