Reaction Details
TargetPolyunsaturated fatty acid lipoxygenase ALOX15
LigandBDBM50137349
Substrate/Competitorn/a
Meas. Tech.ChEBML_29
IC50 24200±n/a nM
Citation Lin, BBMorita, TLin, YSChen, HL A facile synthesis of 1-ethoxy-4-cyano-5-ethoxycarbonyl-3H-azuleno[1,2-c]pyran-3-one, a selective 15-lipoxygenase inhibitor. Bioorg Med Chem Lett14:63-5 (2003) Polyunsaturated fatty acid lipoxygenase ALOX15
Name:Polyunsaturated fatty acid lipoxygenase ALOX15
Type:Protein
Mol. Mass.:74804.05
Organism:Homo sapiens (Human)
Description:n/a
Residue:662
BDBM50137349
NameBDBM50137349
Synonyms:1-Cyano-4-ethoxy-2-oxo-2H-3-oxa-benzo[a]azulene-10-carboxylic acid ethyl ester | CHEMBL157082
TypeSmall organic molecule
Emp. Form.C19H15NO5
Mol. Mass.337.3261
SMILESCCOC(=O)c1c2cccccc2c2c(OCC)oc(=O)c(C#N)c12