Reaction Details
TargetPolyunsaturated fatty acid lipoxygenase ALOX15
LigandBDBM50009004
Substrate/Competitorn/a
Meas. Tech.ChEBML_29
IC50 2200±n/a nM
Citation Lin, BBMorita, TLin, YSChen, HL A facile synthesis of 1-ethoxy-4-cyano-5-ethoxycarbonyl-3H-azuleno[1,2-c]pyran-3-one, a selective 15-lipoxygenase inhibitor. Bioorg Med Chem Lett14:63-5 (2003) Polyunsaturated fatty acid lipoxygenase ALOX15
Name:Polyunsaturated fatty acid lipoxygenase ALOX15
Type:Protein
Mol. Mass.:74804.05
Organism:Homo sapiens (Human)
Description:n/a
Residue:662
BDBM50009004
NameBDBM50009004
Synonyms:(phenidone)1-Phenyl-pyrazolidin-3-one 1-Phenyl-pyrazolidin-3-one (Phenidone) 1-phenylpyrazolidin-3-one PHENIDONE
TypeSmall organic molecule
Emp. Form.C9H10N2O
Mol. Mass.162.1885
SMILESO=C1CCN(N1)c1ccccc1