Reaction Details
TargetAlpha-galactosidase A
LigandBDBM50137350
Substrate/Competitorn/a
Meas. Tech.ChEBML_34241
Ki 400000±n/a nM
Citation Kröger, LHenkensmeier, DSchäfer, AThiem, J Novel O-glycosyl amino acid mimetics as building blocks for O-glycopeptides act as inhibitors of galactosidases. Bioorg Med Chem Lett14:73-5 (2003) Alpha-galactosidase A
Name:Alpha-galactosidase A
Type:Protein
Mol. Mass.:48760.21
Organism:Homo sapiens (Human)
Description:n/a
Residue:429
BDBM50137350
NameBDBM50137350
Synonyms:2-Amino-3-(3,4,5,6-tetrahydroxy-tetrahydro-pyran-2-ylmethoxy)-propionic acid | CHEMBL3215441
TypeSmall organic molecule
Emp. Form.C9H17NO8
Mol. Mass.267.2332
SMILESN[C@@H](COC[C@H]1O[C@@H](O)[C@H](O)[C@H](O)[C@@H]1O)C(O)=O