Reaction Details
TargetAryl hydrocarbon receptor
LigandBDBM50137506
Substrate/Competitorn/a
Meas. Tech.ChEBML_36350
EC50 5±n/a nM
Citation Murata, MGonda, HYano, KKuroki, SSuzutani, TKatayama, Y An electrochemical device for the assay of the interaction between a dioxin receptor and its various ligands. Bioorg Med Chem Lett14:137-41 (2003) Aryl hydrocarbon receptor
Name:Aryl hydrocarbon receptor
Type:PROTEIN
Mol. Mass.:96143.77
Organism:Homo sapiens (Human)
Description:ChEMBL_1503828
Residue:848
BDBM50137506
NameBDBM50137506
Synonyms:(B(a)P) 3,4-Benzopyrene Benzo(a)pyrene benzo[a]pyrene benzo[pqr]tetraphene
TypeSmall organic molecule
Emp. Form.C20H12
Mol. Mass.252.3093
SMILESc1ccc2c(c1)cc1ccc3cccc4ccc2c1c34