Reaction Details
TargetNeuronal acetylcholine receptor; alpha2/beta4
LigandBDBM50137787
Substrate/Competitorn/a
Meas. Tech.ChEMBL_143234 (CHEMBL752377)
Ki 31±n/a nM
Citation Bremner, JBGodfrey, CAJensen, AASmith, RJ Synthesis and nicotinic receptor activity of a hydroxylated tropane. Bioorg Med Chem Lett14:271-3 (2003) Neuronal acetylcholine receptor; alpha2/beta4
Name:Neuronal acetylcholine receptor; alpha2/beta4
Type:n/a
Mol. Mass.:n/a
Description:ASSAY_ID of ChEMBL is 2150172
Components:This complex has 2 components.
Component 1
Name:Neuronal acetylcholine receptor subunit beta-4
Synonyms:ACHB4_HUMAN Cholinergic, Nicotinic Alpha6Beta3Beta4Alpha5 Nicotinic acetylcholine receptor alpha6/alpha3/beta4
Type:Enzyme Catalytic Domain
Mol. Mass.:56388.51
Organism:Homo sapiens (Human)
Description:Cholinergic, Nicotinic Alpha6Beta3Beta4Alpha5 0 HUMAN::P30926
Residue:498
Component 2
Name:Neuronal acetylcholine receptor subunit alpha-2
Synonyms:ACHA2_HUMAN Neuronal acetylcholine receptor; alpha2/beta2
Type:Enzyme Catalytic Domain
Mol. Mass.:59759.69
Organism:Homo sapiens (Human)
Description:Cholinergic, Nicotinic Alpha2Beta2 0 HUMAN::Q15822
Residue:529
BDBM50137787
NameBDBM50137787
Synonyms:6-(6-Chloro-pyridin-3-yl)-8-aza-bicyclo[3.2.1]octan-3-ol | CHEMBL421553
TypeSmall organic molecule
Emp. Form.C12H15ClN2O
Mol. Mass.238.713
SMILESOC1CC2CC(C(C1)N2)c1ccc(Cl)nc1