Reaction Details
TargetHistone deacetylase 1
LigandBDBM50137836
Substrate/Competitorn/a
Meas. Tech.ChEBML_87538
IC50 4000±n/a nM
Citation Vaisburg, ABernstein, NFrechette, SAllan, MAbou-Khalil, ELeit, SMoradei, OBouchain, GWang, JWoo, SHFournel, MYan, PTTrachy-Bourget, MCKalita, ABeaulieu, CLi, ZMacLeod, ARBesterman, JMDelorme, D (2-amino-phenyl)-amides of omega-substituted alkanoic acids as new histone deacetylase inhibitors. Bioorg Med Chem Lett14:283-7 (2003) Histone deacetylase 1
Name:Histone deacetylase 1
Type:Enzyme
Mol. Mass.:55090.27
Organism:Homo sapiens (Human)
Description:Q13547
Residue:482
BDBM50137836
NameBDBM50137836
Synonyms:8-(3',4'-Dimethoxy-biphenyl-4-yl)-8-oxo-octanoic acid (2-amino-phenyl)-amide | CHEMBL98724
TypeSmall organic molecule
Emp. Form.C28H32N2O4
Mol. Mass.460.5647
SMILESCOc1ccc(cc1OC)-c1ccc(cc1)C(=O)CCCCCCC(=O)Nc1ccccc1N