Reaction Details
TargetCalpain small subunit 1
LigandBDBM50137936
Substrate/Competitorn/a
Meas. Tech.ChEBML_43862
Ki 4190.0±n/a nM
Citation Donkor, IOHan, JZheng, X Design, synthesis, molecular modeling studies, and calpain inhibitory activity of novel alpha-ketoamides incorporating polar residues at the P1'-position. J Med Chem47:72-9 (2003) 
 
Calpain small subunit 1
Name:Calpain small subunit 1
Type:PROTEIN
Mol. Mass.:28062.13
Organism:Sus scrofa
Description:ChEMBL_43862
Residue:266
BDBM50137936
NameBDBM50137936
Synonyms:CHEMBL178747 | {(S)-1-[2-((S)-1-Hydrazinomethyl-2-phenyl-ethylcarbamoyl)-2-oxo-1-((S)-phenylmethyl)-ethylcarbamoyl]-3-methyl-butyl}-carbamic acid benzyl ester
TypeSmall organic molecule
Emp. Form.C33H41N5O5
Mol. Mass.587.7091
SMILESCC(C)CC(NC(=O)OCc1ccccc1)C(=O)N[C@@H](Cc1ccccc1)C(=O)C(=O)N[C@H](CNN)Cc1ccccc1