Reaction Details
TargetCalpain small subunit 1
LigandBDBM50137937
Substrate/Competitorn/a
Meas. Tech.ChEBML_43862
Ki 830±n/a nM
Citation Donkor, IOHan, JZheng, X Design, synthesis, molecular modeling studies, and calpain inhibitory activity of novel alpha-ketoamides incorporating polar residues at the P1'-position. J Med Chem47:72-9 (2003) 
 
Calpain small subunit 1
Name:Calpain small subunit 1
Type:PROTEIN
Mol. Mass.:28062.13
Organism:Sus scrofa
Description:ChEMBL_43862
Residue:266
BDBM50137937
NameBDBM50137937
Synonyms:2-[(S)-3-((S)-2-Benzyloxycarbonylamino-4-methyl-pentanoylamino)-2-oxo-4-phenyl-butyrylamino]-3-(S)-phenyl-propionic acid | CHEMBL177404
TypeSmall organic molecule
Emp. Form.C33H37N3O7
Mol. Mass.587.6628
SMILESCC(C)CC(NC(=O)OCc1ccccc1)C(=O)N[C@@H](Cc1ccccc1)C(=O)C(=O)N[C@@H](Cc1ccccc1)C(O)=O