Reaction Details
TargetDelta-type opioid receptor
LigandBDBM50137996
Substrate/Competitorn/a
Meas. Tech.ChEMBL_147025 (CHEMBL753666)
Ki 1±n/a nM
Citation Zhang, AXiong, WBidlack, JMHilbert, JEKnapp, BIWentland, MPNeumeyer, JL 10-Ketomorphinan and 3-substituted-3-desoxymorphinan analogues as mixed kappa and micro opioid ligands: synthesis and biological evaluation of their binding affinity at opioid receptors. J Med Chem47:165-74 (2003) 
 
Delta-type opioid receptor
Name:Delta-type opioid receptor
Type:G Protein-Coupled Receptor (GPCR)
Mol. Mass.:40382.98
Organism:Homo sapiens (Human)
Description:Competition binding assays were carried out using membrane preparations from transfected HN9.10 cells that constitutively expressed the delta opioid receptor.
Residue:372
BDBM50137996
NameBDBM50137996
Synonyms:3-Carboxamido-N-cyclopropylmethylmorphinan | CHEMBL300033
TypeSmall organic molecule
Emp. Form.C21H28N2O
Mol. Mass.324.4598
SMILESNC(=O)c1ccc2C[C@@H]3[C@@H]4CCCC[C@]4(CCN3CC3CC3)c2c1